Reaction Details
TargetProtein kinase C alpha type
LigandBDBM50282632
Substrate/Competitorn/a
Meas. Tech.ChEMBL_160140 (CHEMBL768986)
IC50 2.85±n/a nM
Citation Davis, PDHallam, TJHarris, WHill, CHLawton, GNixon, JSSmith, JLVesey, DRWilkinson, SE Bisindolylmaleimide inhibitors of protein kinase C. Further conformational restriction of a tertiary amine side chain. Bioorg Med Chem Lett4:1303-1308 (1994)    Article
 
Protein kinase C alpha type
Name:Protein kinase C alpha type
Type:Protein
Mol. Mass.:76797.67
Organism:Rattus norvegicus (Rat)
Description:P05696
Residue:672
BDBM50282632
NameBDBM50282632
Synonyms:3-((3aR,10aR)-2-Methyl-2,3,3a,4,10,10a-hexahydro-1H-2,4a-diaza-cyclopenta[b]fluoren-9-yl)-4-(1-methyl-1H-indol-3-yl)-pyrrole-2,5-dione; hydrochloride Ro-32-0557
TypeSmall organic molecule
Emp. Form.C28H26N4O2
Mol. Mass.450.5316
SMILESCN1C[C@@H]2Cc3c(C4=C(C(=O)NC4=O)c4cn(C)c5ccccc45)c4ccccc4n3C[C@H]2C1