Reaction Details
Target5-hydroxytryptamine receptor 4
LigandBDBM10755
Substrate/Competitorn/a
Meas. Tech.ChEMBL_3241 (CHEMBL618927)
EC50 5±n/a nM
Citation Langlois, MZhang, LBre´mont, BShen, SManara, LCroci, T Design of a potent 5-HT4 receptor agonist with nanomolar affinity Bioorg Med Chem Lett4:1433-1436 (1994)    Article
 
5-hydroxytryptamine receptor 4
Name:5-hydroxytryptamine receptor 4
Type:Enzyme Catalytic Domain
Mol. Mass.:43735.29
Organism:GUINEA PIG
Description:5-HT4 HTR4 GUINEA PIG::O70528
Residue:388
BDBM10755
NameBDBM10755
Synonyms:14C-5-hydroxy tryptamine creatinine disulfate 5-HT 5-hydroxy tryptamine creatinine disulfate Serotonin | [3H]-5-HT
TypeSmall organic molecule
Emp. Form.C10H12N2O
Mol. Mass.176.2151
SMILESNCCc1c[nH]c2ccc(O)cc12