Reaction Details
TargetRetinoic acid receptor alpha
LigandBDBM50045276
Substrate/Competitorn/a
Meas. Tech.ChEMBL_163473 (CHEMBL772308)
EC50 24±n/a nM
Citation Beard, RLGil, DWMarler, DKHenry, EColon, DFGillett, SJArefieg, TBreen, TSKrauss, HDavies, PJChandraratna, RA Structural basis for the differential RXR & RAR activity of stilbene retinoid analogs Bioorg Med Chem Lett4:1447-1452 (1994)    Article
 
Retinoic acid receptor alpha
Name:Retinoic acid receptor alpha
Type:PROTEIN
Mol. Mass.:50778.87
Organism:Homo sapiens (Human)
Description:ChEMBL_1466191
Residue:462
BDBM50045276
NameBDBM50045276
Synonyms:4-[(E)-1-Methyl-2-(5,5,8,8-tetramethyl-5,6,7,8-tetrahydro-naphthalen-2-yl)-vinyl]-benzoic acid CHEMBL285179
TypeSmall organic molecule
Emp. Form.C24H28O2
Mol. Mass.348.4779
SMILESC\C(=C/c1ccc2c(c1)C(C)(C)CCC2(C)C)c1ccc(cc1)C(O)=O