Reaction Details
TargetRetinoic acid receptor gamma
LigandBDBM50044099
Substrate/Competitorn/a
Meas. Tech.ChEMBL_163481 (CHEMBL772394)
EC50 195±n/a nM
Citation Beard, RLGil, DWMarler, DKHenry, EColon, DFGillett, SJArefieg, TBreen, TSKrauss, HDavies, PJChandraratna, RA Structural basis for the differential RXR & RAR activity of stilbene retinoid analogs Bioorg Med Chem Lett4:1447-1452 (1994)    Article
 
Retinoic acid receptor gamma
Name:Retinoic acid receptor gamma
Type:PROTEIN
Mol. Mass.:50345.43
Organism:Homo sapiens (Human)
Description:ChEMBL_1458016
Residue:454
BDBM50044099
NameBDBM50044099
Synonyms:4-[(E)-2-(3-Ethyl-5,5,8,8-tetramethyl-5,6,7,8-tetrahydro-naphthalen-2-yl)-propenyl]-benzoic acid | CHEMBL284937
TypeSmall organic molecule
Emp. Form.C26H32O2
Mol. Mass.376.5311
SMILESCCc1cc2c(cc1\C(C)=C\c1ccc(cc1)C(O)=O)C(C)(C)CCC2(C)C