Reaction Details
TargetRetinoic acid receptor beta
LigandBDBM50282694
Substrate/Competitorn/a
Meas. Tech.ChEMBL_163477 (CHEMBL772312)
EC50 21±n/a nM
Citation Beard, RLGil, DWMarler, DKHenry, EColon, DFGillett, SJArefieg, TBreen, TSKrauss, HDavies, PJChandraratna, RA Structural basis for the differential RXR & RAR activity of stilbene retinoid analogs Bioorg Med Chem Lett4:1447-1452 (1994)    Article
 
Retinoic acid receptor beta
Name:Retinoic acid receptor beta
Type:PROTEIN
Mol. Mass.:50498.70
Organism:Homo sapiens (Human)
Description:ChEMBL_1458015
Residue:455
BDBM50282694
NameBDBM50282694
Synonyms:4-[(E)-2-(3-Bromo-5,5,8,8-tetramethyl-5,6,7,8-tetrahydro-naphthalen-2-yl)-propenyl]-benzoic acid | CHEMBL284167
TypeSmall organic molecule
Emp. Form.C24H27BrO2
Mol. Mass.427.374
SMILESC\C(=C/c1ccc(cc1)C(O)=O)c1cc2c(cc1Br)C(C)(C)CCC2(C)C