Reaction Details
TargetPeptidyl-prolyl cis-trans isomerase FKBP1A
LigandBDBM50282772
Substrate/Competitorn/a
Meas. Tech.ChEBML_66420
Ki 207±n/a nM
Citation Teague, SJCooper, MEDonald, DKFurber, M Synthesis and study of a non macrocyclic FK506 derivative. Bioorg Med Chem Lett4:1581-1584 (1994)    Article
 
Peptidyl-prolyl cis-trans isomerase FKBP1A
Name:Peptidyl-prolyl cis-trans isomerase FKBP1A
Type:Isomerase
Mol. Mass.:11953.09
Organism:Homo sapiens (Human)
Description:P62942
Residue:108
BDBM50282772
NameBDBM50282772
Synonyms:CHEMBL290015 | SLB-606
TypeSmall organic molecule
Emp. Form.C42H67NO11
Mol. Mass.761.9815
SMILESCO[C@@H](\C=C/C)[C@@H]1CC[C@@H](C)[C@@](O)(O1)C(=O)C(=O)N1CCCC[C@H]1C(=O)O[C@H]([C@H](C)C[C@@H]1CC[C@@H](O)[C@@H](C1)OC)[C@H](C)[C@@H](O)CC(=O)C(CC=C)CC=C