Reaction Details
TargetNeutrophil elastase
LigandBDBM50282865
Substrate/Competitorn/a
Meas. Tech.ChEBML_64002
Ki 1.8±n/a nM
Citation Hlasta, DJBell, MRBoaz, NWCourt, JJDesai, RCFranke, CAMura, AJSubramanyam, CDunlap, RP A benzisothiazolone class of potent, selective mechanism-based inhibitors of human leukocyte elastase Bioorg Med Chem Lett4:1801-1806 (1994)    Article
 
Neutrophil elastase
Name:Neutrophil elastase
Type:Enzyme
Mol. Mass.:28532.38
Organism:Homo sapiens (Human)
Description:P08246
Residue:267
BDBM50282865
NameBDBM50282865
Synonyms:2-Chloromethyl-1,1-dioxo-1,2-dihydro-1lambda*6*-benzo[d]isothiazol-3-one PD120339
TypeSmall organic molecule
Emp. Form.C8H6ClNO3S
Mol. Mass.231.656
SMILESClCN1C(=O)c2ccccc2S1(=O)=O