Reaction Details
TargetNeutrophil elastase
LigandBDBM50282866
Substrate/Competitorn/a
Meas. Tech.ChEBML_64002
Ki 2±n/a nM
Citation Hlasta, DJBell, MRBoaz, NWCourt, JJDesai, RCFranke, CAMura, AJSubramanyam, CDunlap, RP A benzisothiazolone class of potent, selective mechanism-based inhibitors of human leukocyte elastase Bioorg Med Chem Lett4:1801-1806 (1994)    Article
 
Neutrophil elastase
Name:Neutrophil elastase
Type:Enzyme
Mol. Mass.:28532.38
Organism:Homo sapiens (Human)
Description:P08246
Residue:267
BDBM50282866
NameBDBM50282866
Synonyms:4-Ethyl-1,1-dioxo-2-(1-phenyl-1H-tetrazol-5-ylsulfanylmethyl)-1,2-dihydro-1lambda*6*-benzo[d]isothiazol-3-one | CHEMBL296159
TypeSmall organic molecule
Emp. Form.C17H15N5O3S2
Mol. Mass.401.463
SMILESCCc1cccc2c1C(=O)N(CSc1nnnn1-c1ccccc1)S2(=O)=O