Reaction Details
TargetPhospholipase A2, membrane associated
LigandBDBM50242184
Substrate/Competitorn/a
Meas. Tech.ChEMBL_156194 (CHEMBL767138)
IC50 15±n/a nM
Citation Glaser, KBSung, MLLock, YWBauer, JKubrak, DKreft, A Analogs of the marine natural product scalaradial lacking the α,β-unsaturated aldehyde: effects on human synovial fluid phospholipase A2 and macrophage lipid mediator production Bioorg Med Chem Lett4:1873-1878 (1994)    Article
 
Phospholipase A2, membrane associated
Name:Phospholipase A2, membrane associated
Type:Hydrolase
Mol. Mass.:16101.20
Organism:Homo sapiens (Human)
Description:The human nps PLA2 was cloned, and expressed in E. coli. There was a refolding process in the purification.
Residue:144
BDBM50242184
NameBDBM50242184
Synonyms:Scalaradial
TypeSmall organic molecule
Emp. Form.C27H40O4
Mol. Mass.428.6041
SMILES[H][C@@]12CC[C@@]3(C)[C@]4([H])CC=C(C=O)[C@H](C=O)[C@@]4(C)[C@H](C[C@]3([H])[C@@]1(C)CCCC2(C)C)OC(C)=O