Reaction Details
TargetCaspase-1
LigandBDBM50282979
Substrate/Competitorn/a
Meas. Tech.ChEBML_91007
Ki 27±n/a nM
Citation Mjalli, AMChapman, KTMacCoss, MThornberry, NAPeterson, EP Activated ketones as potent reversible inhibitors of interleukin-Iβ converting enzyme Bioorg Med Chem Lett4:1965-1968 (1994)    Article
 
Caspase-1
Name:Caspase-1
Type:Enzyme
Mol. Mass.:45154.13
Organism:Homo sapiens (Human)
Description:P29466
Residue:404
BDBM50282979
NameBDBM50282979
Synonyms:3-{(S)-2-[(S)-3-Methyl-2-(3-phenyl-propionylamino)-butyrylamino]-propionylamino}-4-oxo-5-(3-phenyl-propane-1-sulfinyl)-pentanoic acid | CHEMBL58894
TypeSmall organic molecule
Emp. Form.C31H41N3O7S
Mol. Mass.599.738
SMILESCC(C)[C@H](NC(=O)CCc1ccccc1)C(=O)N[C@@H](C)C(=O)NC(CC(O)=O)C(=O)CS(=O)CCCc1ccccc1