Reaction Details
TargetCaspase-1
LigandBDBM50282980
Substrate/Competitorn/a
Meas. Tech.ChEBML_91007
Ki 60±n/a nM
Citation Mjalli, AMChapman, KTMacCoss, MThornberry, NAPeterson, EP Activated ketones as potent reversible inhibitors of interleukin-Iβ converting enzyme Bioorg Med Chem Lett4:1965-1968 (1994)    Article
 
Caspase-1
Name:Caspase-1
Type:Enzyme
Mol. Mass.:45154.13
Organism:Homo sapiens (Human)
Description:P29466
Residue:404
BDBM50282980
NameBDBM50282980
Synonyms:5-(Benzyl-phenethyl-amino)-3-{(S)-2-[(S)-3-methyl-2-(3-phenyl-propionylamino)-butyrylamino]-propionylamino}-4-oxo-pentanoic acid | CHEMBL59362
TypeSmall organic molecule
Emp. Form.C37H46N4O6
Mol. Mass.642.7843
SMILESCC(C)[C@H](NC(=O)CCc1ccccc1)C(=O)N[C@@H](C)C(=O)NC(CC(O)=O)C(=O)CN(CCc1ccccc1)Cc1ccccc1