Reaction Details
TargetCaspase-1
LigandBDBM50282984
Substrate/Competitorn/a
Meas. Tech.ChEBML_91007
Ki 11±n/a nM
Citation Mjalli, AMChapman, KTMacCoss, MThornberry, NAPeterson, EP Activated ketones as potent reversible inhibitors of interleukin-Iβ converting enzyme Bioorg Med Chem Lett4:1965-1968 (1994)    Article
 
Caspase-1
Name:Caspase-1
Type:Enzyme
Mol. Mass.:45154.13
Organism:Homo sapiens (Human)
Description:P29466
Residue:404
BDBM50282984
NameBDBM50282984
Synonyms:3-{(S)-2-[(S)-3-Methyl-2-(3-phenyl-propionylamino)-butyrylamino]-propionylamino}-4-oxo-5-(3-phenyl-propylsulfanyl)-pentanoic acid | CHEMBL59463
TypeSmall organic molecule
Emp. Form.C31H41N3O6S
Mol. Mass.583.739
SMILESCC(C)[C@H](NC(=O)CCc1ccccc1)C(=O)N[C@@H](C)C(=O)NC(CC(O)=O)C(=O)CSCCCc1ccccc1