Reaction Details
TargetNeutrophil elastase
LigandBDBM50058391
Substrate/Competitorn/a
Meas. Tech.ChEBML_86531
Ki 3.1±n/a nM
Citation Bernstein, PRKosmider, BJVacek, EPVeale, CAGomes, BC Examination of peptidic α′,β-diamino-α,α-difluoroketones as inhibitors of human leukocyte elastase Bioorg Med Chem Lett4:2175-2178 (1994)    Article
 
Neutrophil elastase
Name:Neutrophil elastase
Type:Enzyme
Mol. Mass.:28532.38
Organism:Homo sapiens (Human)
Description:P08246
Residue:267
BDBM50058391
NameBDBM50058391
Synonyms:(S)-1-[(S)-2-(4-Methoxy-benzoylamino)-3-methyl-butyryl]-pyrrolidine-2-carboxylic acid ((S)-3,3,3-trifluoro-1-isopropyl-2-oxo-propyl)-amide | CHEMBL55210
TypeSmall organic molecule
Emp. Form.C24H32F3N3O5
Mol. Mass.499.5232
SMILESCOc1ccc(cc1)C(=O)N[C@@H](C(C)C)C(=O)N1CCC[C@H]1C(=O)N[C@@H](C(C)C)C(=O)C(F)(F)F