Reaction Details
TargetNeutrophil elastase
LigandBDBM50061054
Substrate/Competitorn/a
Meas. Tech.ChEBML_86531
Ki 0.810000±n/a nM
Citation Bernstein, PRKosmider, BJVacek, EPVeale, CAGomes, BC Examination of peptidic α′,β-diamino-α,α-difluoroketones as inhibitors of human leukocyte elastase Bioorg Med Chem Lett4:2175-2178 (1994)    Article
 
Neutrophil elastase
Name:Neutrophil elastase
Type:Enzyme
Mol. Mass.:28532.38
Organism:Homo sapiens (Human)
Description:P08246
Residue:267
BDBM50061054
NameBDBM50061054
Synonyms:CHEMBL110125 {(S)-1-[(S)-2-((S)-4-Amino-3,3-difluoro-1-isopropyl-2-oxo-butylcarbamoyl)-pyrrolidine-1-carbonyl]-2-methyl-propyl}-carbamic acid phenyl ester
TypeSmall organic molecule
Emp. Form.C24H34F2N4O5
Mol. Mass.496.5474
SMILESCC(C)[C@H](NC(=O)Oc1ccccc1)C(=O)N1CCC[C@H]1C(=O)N[C@@H](C(C)C)C(=O)C(F)(F)CN