Reaction Details
TargetNeutrophil elastase
LigandBDBM50061036
Substrate/Competitorn/a
Meas. Tech.ChEBML_86531
Ki 0.850000±n/a nM
Citation Bernstein, PRKosmider, BJVacek, EPVeale, CAGomes, BC Examination of peptidic α′,β-diamino-α,α-difluoroketones as inhibitors of human leukocyte elastase Bioorg Med Chem Lett4:2175-2178 (1994)    Article
 
Neutrophil elastase
Name:Neutrophil elastase
Type:Enzyme
Mol. Mass.:28532.38
Organism:Homo sapiens (Human)
Description:P08246
Residue:267
BDBM50061036
NameBDBM50061036
Synonyms:CHEMBL304114 | {(S)-1-[(S)-2-((S)-3,3-Difluoro-1-isopropyl-3-methylcarbamoyl-2-oxo-propylcarbamoyl)-pyrrolidine-1-carbonyl]-2-methyl-propyl}-carbamic acid phenyl ester
TypeSmall organic molecule
Emp. Form.C25H34F2N4O6
Mol. Mass.524.5575
SMILESCNC(=O)C(F)(F)C(=O)[C@@H](NC(=O)[C@@H]1CCCN1C(=O)[C@@H](NC(=O)Oc1ccccc1)C(C)C)C(C)C