Reaction Details
TargetCaspase-1
LigandBDBM50283345
Substrate/Competitorn/a
Meas. Tech.ChEBML_91005
Ki 7.5±n/a nM
Citation Mullican, MDLauffer, DJGillespie, RJMatharu, SSKay, DPorritt, GMEvans, PLGolec, JMMurcko, MALuong, YPRaybuck, SALivingston, DJ The synthesis and evaluation of peptidyl aspartyl aldehydes as inhibitors of ice. Bioorg Med Chem Lett4:2359-2364 (1994)    Article
 
Caspase-1
Name:Caspase-1
Type:Enzyme
Mol. Mass.:45154.13
Organism:Homo sapiens (Human)
Description:P29466
Residue:404
BDBM50283345
NameBDBM50283345
Synonyms:(S)-3-((S)-2-{(S)-2-[(S)-2-Acetylamino-3-(4-hydroxy-3,5-diiodo-phenyl)-propionylamino]-3-methyl-butyrylamino}-propionylamino)-4-oxo-butyric acid | CHEMBL76199
TypeSmall organic molecule
Emp. Form.C23H30I2N4O8
Mol. Mass.744.3152
SMILESCC(C)[C@H](NC(=O)[C@H](Cc1cc(I)c(O)c(I)c1)NC(C)=O)C(=O)N[C@@H](C)C(=O)N[C@@H](CC(O)=O)C=O