Reaction Details
TargetCaspase-1
LigandBDBM50091562
Substrate/Competitorn/a
Meas. Tech.ChEBML_91005
Ki>20000±n/a nM
Citation Mullican, MDLauffer, DJGillespie, RJMatharu, SSKay, DPorritt, GMEvans, PLGolec, JMMurcko, MALuong, YPRaybuck, SALivingston, DJ The synthesis and evaluation of peptidyl aspartyl aldehydes as inhibitors of ice. Bioorg Med Chem Lett4:2359-2364 (1994)    Article
 
Caspase-1
Name:Caspase-1
Type:Enzyme
Mol. Mass.:45154.13
Organism:Homo sapiens (Human)
Description:P29466
Residue:404
BDBM50091562
NameBDBM50091562
Synonyms:3-((S)-2-{(S)-2-[(S)-2-Acetylamino-3-(4-hydroxy-phenyl)-propionylamino]-3-methyl-butyrylamino}-propionylamino)-propionic acid CHEMBL308500
TypeSmall organic molecule
Emp. Form.C22H32N4O7
Mol. Mass.464.5121
SMILESCC(C)[C@H](NC(=O)[C@H](Cc1ccc(O)cc1)NC(C)=O)C(=O)N[C@@H](C)C(=O)NCCC(O)=O