Reaction Details
TargetCaspase-1
LigandBDBM50283347
Substrate/Competitorn/a
Meas. Tech.ChEBML_91005
Ki>20000±n/a nM
Citation Mullican, MDLauffer, DJGillespie, RJMatharu, SSKay, DPorritt, GMEvans, PLGolec, JMMurcko, MALuong, YPRaybuck, SALivingston, DJ The synthesis and evaluation of peptidyl aspartyl aldehydes as inhibitors of ice. Bioorg Med Chem Lett4:2359-2364 (1994)    Article
 
Caspase-1
Name:Caspase-1
Type:Enzyme
Mol. Mass.:45154.13
Organism:Homo sapiens (Human)
Description:P29466
Residue:404
BDBM50283347
NameBDBM50283347
Synonyms:(S)-3-((S)-2-Acetylamino-propionylamino)-4-oxo-butyric acid | CHEMBL76565
TypeSmall organic molecule
Emp. Form.C9H14N2O5
Mol. Mass.230.2179
SMILESC[C@H](NC(C)=O)C(=O)N[C@@H](CC(O)=O)C=O