Reaction Details
TargetPolyunsaturated fatty acid 5-lipoxygenase
LigandBDBM50283407
Substrate/Competitorn/a
Meas. Tech.ChEBML_3954
IC50 20±n/a nM
Citation LeMahieu, RACarson, MHan, RJWill, PCThomas, TKNagy, CCominelli, F 4-[5-(2,3-dihydroxyphenyl)pentyloxy]-2-hydroxy-3-propylbenzoic acid (Ro 24-0553): an orally active 5-lipoxygenase inhibitor with antiinflammatory activity Bioorg Med Chem Lett4:339-344 (1994)    Article
 
Polyunsaturated fatty acid 5-lipoxygenase
Name:Polyunsaturated fatty acid 5-lipoxygenase
Type:PROTEIN
Mol. Mass.:78082.31
Organism:Rattus norvegicus
Description:ChEMBL_1432947
Residue:673
BDBM50283407
NameBDBM50283407
Synonyms:4-[10-(2,3-Dihydroxy-phenyl)-decyloxy]-2-hydroxy-3-propyl-benzoic acid | CHEMBL114013
TypeSmall organic molecule
Emp. Form.C26H36O6
Mol. Mass.444.5604
SMILESCCCc1c(O)c(ccc1OCCCCCCCCCCc1cccc(O)c1O)C(O)=O