Reaction Details
TargetVoltage-dependent L-type calcium channel subunit alpha-1C
LigandBDBM50283418
Substrate/Competitorn/a
Meas. Tech.ChEBML_42915
IC50>1000±n/a nM
Citation Kane, JMCarr, AACheng, HCDudley, MWRampe, DStaeger, MA Heterocyclic guanidines as calcium antagonists Bioorg Med Chem Lett4:351-354 (1994)    Article
 
Voltage-dependent L-type calcium channel subunit alpha-1C
Name:Voltage-dependent L-type calcium channel subunit alpha-1C
Type:Enzyme Catalytic Domain
Mol. Mass.:243492.26
Organism:RAT
Description:Calcium channel 0 RAT::P22002
Residue:2169
BDBM50283418
NameBDBM50283418
Synonyms:(3,3-Diphenyl-propyl)-((E)-1,4,5,6,7,8-hexahydro-[1,3]diazocin-2-yl)-amine | CHEMBL117984
TypeSmall organic molecule
Emp. Form.C21H27N3
Mol. Mass.321.4592
SMILESC(CC(c1ccccc1)c1ccccc1)NC1=NCCCCCN1