Reaction Details
TargetVoltage-dependent L-type calcium channel subunit alpha-1C
LigandBDBM50283424
Substrate/Competitorn/a
Meas. Tech.ChEBML_42915
IC50>1000±n/a nM
Citation Kane, JMCarr, AACheng, HCDudley, MWRampe, DStaeger, MA Heterocyclic guanidines as calcium antagonists Bioorg Med Chem Lett4:351-354 (1994)    Article
 
Voltage-dependent L-type calcium channel subunit alpha-1C
Name:Voltage-dependent L-type calcium channel subunit alpha-1C
Type:Enzyme Catalytic Domain
Mol. Mass.:243492.26
Organism:RAT
Description:Calcium channel 0 RAT::P22002
Residue:2169
BDBM50283424
NameBDBM50283424
Synonyms:(2,2-Diphenyl-ethyl)-(4,5,6,7-tetrahydro-1H-[1,3]diazepin-2-yl)-amine | CHEMBL119290
TypeSmall organic molecule
Emp. Form.C19H23N3
Mol. Mass.293.406
SMILESC(NC1=NCCCCN1)C(c1ccccc1)c1ccccc1