Reaction Details
TargetVoltage-dependent L-type calcium channel subunit alpha-1C
LigandBDBM50283425
Substrate/Competitorn/a
Meas. Tech.ChEBML_42915
IC50>1000±n/a nM
Citation Kane, JMCarr, AACheng, HCDudley, MWRampe, DStaeger, MA Heterocyclic guanidines as calcium antagonists Bioorg Med Chem Lett4:351-354 (1994)    Article
 
Voltage-dependent L-type calcium channel subunit alpha-1C
Name:Voltage-dependent L-type calcium channel subunit alpha-1C
Type:Enzyme Catalytic Domain
Mol. Mass.:243492.26
Organism:RAT
Description:Calcium channel 0 RAT::P22002
Residue:2169
BDBM50283425
NameBDBM50283425
Synonyms:(2,2-Diphenyl-ethyl)-((E)-1,4,5,6,7,8-hexahydro-[1,3]diazocin-2-yl)-amine | CHEMBL433189
TypeSmall organic molecule
Emp. Form.C20H25N3
Mol. Mass.307.4326
SMILESC(NC1=NCCCCCN1)C(c1ccccc1)c1ccccc1