Reaction Details
TargetVoltage-dependent L-type calcium channel subunit alpha-1C
LigandBDBM50283434
Substrate/Competitorn/a
Meas. Tech.ChEBML_42915
IC50>1000±n/a nM
Citation Kane, JMCarr, AACheng, HCDudley, MWRampe, DStaeger, MA Heterocyclic guanidines as calcium antagonists Bioorg Med Chem Lett4:351-354 (1994)    Article
 
Voltage-dependent L-type calcium channel subunit alpha-1C
Name:Voltage-dependent L-type calcium channel subunit alpha-1C
Type:Enzyme Catalytic Domain
Mol. Mass.:243492.26
Organism:RAT
Description:Calcium channel 0 RAT::P22002
Residue:2169
BDBM50283434
NameBDBM50283434
Synonyms:(2,5-Dihydro-1H-benzo[e][1,3]diazepin-3-yl)-(3,3-diphenyl-propyl)-amine | CHEMBL120011
TypeSmall organic molecule
Emp. Form.C24H25N3
Mol. Mass.355.4754
SMILESC(CC(c1ccccc1)c1ccccc1)NC1=NCc2ccccc2CN1