Reaction Details
TargetProprotein convertase subtilisin/kexin type 9
LigandBDBM50280216
Substrate/Competitorn/a
Meas. Tech.ChEBML_206131
Ki 1000±n/a nM
Citation Steiner, SJBien, JTSmith, BD Diphenylborinic acid is a strong inhibitor of serine proteases Bioorg Med Chem Lett4:2417-2420 (1994)    Article
 
Proprotein convertase subtilisin/kexin type 9
Name:Proprotein convertase subtilisin/kexin type 9
Type:Enzyme
Mol. Mass.:74286.93
Organism:Homo sapiens (Human)
Description:Q8NBP7
Residue:692
BDBM50280216
NameBDBM50280216
Synonyms:Borinic acid derivative Phenyl butyl borinic acid
TypeSmall organic molecule
Emp. Form.C10H15BO
Mol. Mass.162.037
SMILESCCCCB(O)c1ccccc1