Reaction Details
TargetAdenosine receptor A2a
LigandBDBM50051242
Substrate/Competitorn/a
Meas. Tech.ChEMBL_31059 (CHEMBL873043)
Ki 2.4±n/a nM
Citation Baraldi, PGManfredini, SSimoni, DZappaterra, LZocchi, CDionisotti, SOngini, E Synthesis of new pyrazolo[4,3-e]1,2,4-triazolo[1,5-c] pyrimidine and 1,2,3-triazolo[4,5-e]1,2,4-triazolo[1,5-c] pyrimidine displaying potent and selective activity as A2a adenosine receptor antagonists. Bioorg Med Chem Lett4:2539-2544 (1994)    Article
 
Adenosine receptor A2a
Name:Adenosine receptor A2a
Type:G Protein-Coupled Receptor (GPCR)
Mol. Mass.:45015.65
Organism:Rattus norvegicus (rat)
Description:Rat A2A receptors expressed in CHO cells.
Residue:410
BDBM50051242
NameBDBM50051242
Synonyms:8-Butyl-2-furan-2-yl-8H-pyrazolo[4,3-e][1,2,4]triazolo[1,5-c]pyrimidin-5-ylamine CHEMBL16894
TypeSmall organic molecule
Emp. Form.C14H15N7O
Mol. Mass.297.3152
SMILESCCCCn1cc2c(n1)nc(N)n1nc(nc21)-c1ccco1