Reaction Details
TargetType-1 angiotensin II receptor B
LigandBDBM50044355
Substrate/Competitorn/a
Meas. Tech.ChEMBL_34810 (CHEMBL648954)
IC50 5±n/a nM
Citation Huang, HCChamberlain, TSOlins, GMCorpus, VMChen, STMcMahon, EGPalomo, MABlaine, EHManning, RE Discovery of nonpeptide potent conformationally restricted angiotensin II receptor antagonists Bioorg Med Chem Lett4:2591-2596 (1994)    Article
 
Type-1 angiotensin II receptor B
Name:Type-1 angiotensin II receptor B
Type:Enzyme Catalytic Domain
Mol. Mass.:40929.44
Organism:RAT
Description:Angiotensin II AT1B 0 RAT::P29089
Residue:359
BDBM50044355
NameBDBM50044355
Synonyms:2,5-Dibutyl-4-[2'-(1H-tetrazol-5-yl)-biphenyl-4-ylmethyl]-2,4-dihydro-[1,2,4]triazol-3-one(SC-15316) 2,5-Dibutyl-4-[2'-(2H-tetrazol-5-yl)-biphenyl-4-ylmethyl]-[1,2,4]triazolidin-3-one | CHEMBL87778
TypeSmall organic molecule
Emp. Form.C24H29N7O
Mol. Mass.431.5334
SMILESCCCCc1nn(CCCC)c(=O)n1Cc1ccc(cc1)-c1ccccc1-c1nnn[nH]1