Reaction Details
Target72 kDa type IV collagenase
LigandBDBM50101510
Substrate/Competitorn/a
Meas. Tech.ChEBML_101923
Ki 0.300000±n/a nM
Citation Porter, JRBeeley, NRBoyce, BAMason, BMillican, AMillar, KLeonard, JMorphy, JRO'Connell, JP Potent and selective inhibitors of gelatinase-a 1. hydroxamic acid derivatives Bioorg Med Chem Lett4:2741-2746 (1994)    Article
 
72 kDa type IV collagenase
Name:72 kDa type IV collagenase
Type:Enzyme
Mol. Mass.:73870.36
Organism:Homo sapiens (Human)
Description: P08253
Residue:660
BDBM50101510
NameBDBM50101510
Synonyms:(R)-N*1*-((S)-2-Cyclohexyl-1-phenethylcarbamoyl-ethyl)-N*4*-hydroxy-2-[3-(4-trifluoromethyl-phenyl)-propyl]-succinamide N*1*-(2-Cyclohexyl-1-phenethylcarbamoyl-ethyl)-N*4*-hydroxy-2-[3-(4-trifluoromethyl-phenyl)-propyl]-succinamide
TypeSmall organic molecule
Emp. Form.C31H40F3N3O4
Mol. Mass.575.6622
SMILESONC(=O)C[C@@H](CCCc1ccc(cc1)C(F)(F)F)C(=O)N[C@@H](CC1CCCCC1)C(=O)NCCc1ccccc1