Reaction Details
TargetStromelysin-1
LigandBDBM50283705
Substrate/Competitorn/a
Meas. Tech.ChEBML_102088
Ki 1.7±n/a nM
Citation Porter, JRBeeley, NRBoyce, BAMason, BMillican, AMillar, KLeonard, JMorphy, JRO'Connell, JP Potent and selective inhibitors of gelatinase-a 1. hydroxamic acid derivatives Bioorg Med Chem Lett4:2741-2746 (1994)    Article
 
Stromelysin-1
Name:Stromelysin-1
Type:Enzyme
Mol. Mass.:53973.13
Organism:Homo sapiens (Human)
Description: P08254
Residue:477
BDBM50283705
NameBDBM50283705
Synonyms:(R)-2-[3-(4-Chloro-phenyl)-propyl]-N*1*-{(S)-2-cyclohexyl-1-[2-(morpholine-4-sulfonylamino)-ethylcarbamoyl]-ethyl}-N*4*-hydroxy-succinamide | CHEMBL91655
TypeSmall organic molecule
Emp. Form.C28H44ClN5O7S
Mol. Mass.630.196
SMILESONC(=O)C[C@@H](CCCc1ccc(Cl)cc1)C(=O)N[C@@H](CC1CCCCC1)C(=O)NCCNS(=O)(=O)N1CCOCC1