Reaction Details
Target72 kDa type IV collagenase
LigandBDBM50101501
Substrate/Competitorn/a
Meas. Tech.ChEBML_101924
Ki 3.1±n/a nM
Citation Morphy, JRBeeley, NRBoyce, BALeonard, JMason, BMillican, AMillar, KO'Connell, JPPorter, J Potent and selective inhibitors of gelatinase-A 2. carboxylic and phosphonic acid derivatives Bioorg Med Chem Lett4:2747-2752 (1994)    Article
 
72 kDa type IV collagenase
Name:72 kDa type IV collagenase
Type:Enzyme
Mol. Mass.:73870.36
Organism:Homo sapiens (Human)
Description: P08253
Residue:660
BDBM50101501
NameBDBM50101501
Synonyms:(R)-3-(((S)-1-(4-amino-4-oxobutylamino)-3-cyclohexyl-1-oxopropan-2-yl)carbamoyl)-6-phenylhexanoic acid 3-[1-(3-Carbamoyl-propylcarbamoyl)-2-cyclohexyl-ethylcarbamoyl]-6-phenyl-hexanoic acid | CHEMBL77956
TypeSmall organic molecule
Emp. Form.C26H39N3O5
Mol. Mass.473.605
SMILESNC(=O)CCCNC(=O)[C@H](CC1CCCCC1)NC(=O)[C@H](CCCc1ccccc1)CC(O)=O