Reaction Details
Target72 kDa type IV collagenase
LigandBDBM50101506
Substrate/Competitorn/a
Meas. Tech.ChEBML_101924
Ki 6.4±n/a nM
Citation Morphy, JRBeeley, NRBoyce, BALeonard, JMason, BMillican, AMillar, KO'Connell, JPPorter, J Potent and selective inhibitors of gelatinase-A 2. carboxylic and phosphonic acid derivatives Bioorg Med Chem Lett4:2747-2752 (1994)    Article
 
72 kDa type IV collagenase
Name:72 kDa type IV collagenase
Type:Enzyme
Mol. Mass.:73870.36
Organism:Homo sapiens (Human)
Description: P08253
Residue:660
BDBM50101506
NameBDBM50101506
Synonyms:(R)-3-{(S)-2-cyclohexyl-1-[2-(4-sulfamoyl-phenyl)-ethylcarbamoyl]-ethylcarbamoyl}-6-phenyl-hexanoic acid CHEMBL432346
TypeSmall organic molecule
Emp. Form.C30H41N3O6S
Mol. Mass.571.728
SMILESNS(=O)(=O)c1ccc(CCNC(=O)[C@H](CC2CCCCC2)NC(=O)[C@H](CCCc2ccccc2)CC(O)=O)cc1