Reaction Details
Target72 kDa type IV collagenase
LigandBDBM50101524
Substrate/Competitorn/a
Meas. Tech.ChEBML_101924
Ki 3.8±n/a nM
Citation Morphy, JRBeeley, NRBoyce, BALeonard, JMason, BMillican, AMillar, KO'Connell, JPPorter, J Potent and selective inhibitors of gelatinase-A 2. carboxylic and phosphonic acid derivatives Bioorg Med Chem Lett4:2747-2752 (1994)    Article
 
72 kDa type IV collagenase
Name:72 kDa type IV collagenase
Type:Enzyme
Mol. Mass.:73870.36
Organism:Homo sapiens (Human)
Description: P08253
Residue:660
BDBM50101524
NameBDBM50101524
Synonyms:(R)-3-(((S)-1-(2-carboxyethylamino)-3-cyclohexyl-1-oxopropan-2-yl)carbamoyl)-6-p-tolylhexanoic acid 3-[1-(2-Carboxy-ethylcarbamoyl)-2-cyclohexyl-ethylcarbamoyl]-6-p-tolyl-hexanoic acid | CHEMBL306177
TypeSmall organic molecule
Emp. Form.C26H38N2O6
Mol. Mass.474.5897
SMILESCc1ccc(CCC[C@H](CC(O)=O)C(=O)N[C@@H](CC2CCCCC2)C(=O)NCCC(O)=O)cc1