Reaction Details
TargetType-2 angiotensin II receptor
LigandBDBM50030732
Substrate/Competitorn/a
Meas. Tech.ChEBML_36766
IC50 0.240000±n/a nM
Citation Chang, LLAshton, WTFlanagan, KLRivero, RAChen, TBO'Malley, SSZingaro, GJKivlighn, SDSiegl, PKLotti, VJChang, RSGreenlee, WJ Potent triazolinone-based angiotensin II receptor antagonists with equivalent affinity for both the AT1 and AT2 subtypes Bioorg Med Chem Lett4:2787-2792 (1994)    Article
 
Type-2 angiotensin II receptor
Name:Type-2 angiotensin II receptor
Type:Enzyme Catalytic Domain
Mol. Mass.:41346.62
Organism:RAT
Description:Angiotensin II AT2 0 0::P35351
Residue:363
BDBM50030732
NameBDBM50030732
Synonyms:CHEMBL323506 N-{3-[3-Butyl-4-(3-fluoro-5'-propyl-2'-(N-t-butyloxycarbonyl)-Sulfanamido-biphenyl-4-ylmethyl)-5-oxo-4,5-dihydro-[1,2,4]triazol-1-yl]-4-chloro-phenyl}-acetamide
TypeSmall organic molecule
Emp. Form.C35H41ClFN5O6S
Mol. Mass.714.246
SMILESCCCCc1nn(-c2cc(NC(C)=O)ccc2Cl)c(=O)n1Cc1ccc(cc1F)-c1cc(CCC)ccc1S(=O)(=O)NC(=O)OC(C)(C)C