Reaction Details
TargetCholecystokinin receptor type A
LigandBDBM50283831
Substrate/Competitorn/a
Meas. Tech.ChEBML_40039
IC50 1±n/a nM
Citation Lowe, JAQian, WScott, PJMcLean, SBryce, DKCrawford, RTBordner, J 5,7-Diphenyl-3-ureidohexahydroazepin-2-ones as Cholecystokinin-B receptor ligands Bioorg Med Chem Lett4:2877-2882 (1994)    Article
 
Cholecystokinin receptor type A
Name:Cholecystokinin receptor type A
Type:n/a
Mol. Mass.:48229.77
Organism:Cavia porcellus
Description:n/a
Residue:430
BDBM50283831
NameBDBM50283831
Synonyms:CHEMBL319986 | N-tert-Butyl-2-[(3R,5S,7R)-7-(3-fluoro-phenyl)-2-oxo-5-phenyl-3-(3-m-tolyl-ureido)-azepan-1-yl]-acetamide
TypeSmall organic molecule
Emp. Form.C32H37FN4O3
Mol. Mass.544.6596
SMILESCc1cccc(NC(=O)N[C@@H]2C[C@@H](C[C@@H](N(CC(=O)NC(C)(C)C)C2=O)c2cccc(F)c2)c2ccccc2)c1