Reaction Details
TargetCholecystokinin receptor type A
LigandBDBM50283826
Substrate/Competitorn/a
Meas. Tech.ChEBML_40039
IC50 1.8±n/a nM
Citation Lowe, JAQian, WScott, PJMcLean, SBryce, DKCrawford, RTBordner, J 5,7-Diphenyl-3-ureidohexahydroazepin-2-ones as Cholecystokinin-B receptor ligands Bioorg Med Chem Lett4:2877-2882 (1994)    Article
 
Cholecystokinin receptor type A
Name:Cholecystokinin receptor type A
Type:n/a
Mol. Mass.:48229.77
Organism:Cavia porcellus
Description:n/a
Residue:430
BDBM50283826
NameBDBM50283826
Synonyms:CHEMBL327496 | N-tert-Butyl-2-{(3R,5S,7R)-3-[3-(3-fluoro-phenyl)-ureido]-2-oxo-7-phenyl-5-o-tolyl-azepan-1-yl}-acetamide
TypeSmall organic molecule
Emp. Form.C32H37FN4O3
Mol. Mass.544.6596
SMILESCc1ccccc1[C@H]1C[C@@H](NC(=O)Nc2cccc(F)c2)C(=O)N(CC(=O)NC(C)(C)C)[C@H](C1)c1ccccc1