Reaction Details
TargetLeukotriene B4 receptor 1
LigandBDBM50284123
Substrate/Competitorn/a
Meas. Tech.ChEBML_99648
IC50 0.850000±n/a nM
Citation Djuric', SWDocter, SHYu, SSTsai, BSAnglin, CPGaginella, TSKachur, JFKeith, RHMaziasz, TJVillani-Price, DRao, TSWalsh, REWidomski, DLFretland, DJ Synthesis and pharmacological activity of SC-53228, a leukotriene B4 receptor antagonist with high intrinsic potency and selectivity Bioorg Med Chem Lett4:811-816 (1994)    Article
 
Leukotriene B4 receptor 1
Name:Leukotriene B4 receptor 1
Type:Enzyme Catalytic Domain
Mol. Mass.:37582.68
Organism:Homo sapiens (Human)
Description:Q15722
Residue:352
BDBM50284123
NameBDBM50284123
Synonyms:7-[3-(3-Methoxy-4-methylcarbamoyl-2-propyl-phenoxy)-propoxy]-8-propyl-chroman-2-carboxylic acid SC-50073
TypeSmall organic molecule
Emp. Form.C28H37NO7
Mol. Mass.499.5959
SMILESCCCc1c(OCCCOc2ccc3CCC(Oc3c2CCC)C(O)=O)ccc(C(=O)NC)c1OC