Reaction Details
TargetCarnitine O-palmitoyltransferase 1, liver isoform
LigandBDBM50284163
Substrate/Competitorn/a
Meas. Tech.ChEBML_46178
IC50 128000±n/a nM
Citation Kumaravel, GBháird, NNFronczek, FRRamsay, RRAshendel, CLGandour, RD Evaluation of (2S,4S)/(2R,4R) and (2S,4R)/(2<... Bioorg Med Chem Lett4:883-886 (1994)    Article
 
Carnitine O-palmitoyltransferase 1, liver isoform
Name:Carnitine O-palmitoyltransferase 1, liver isoform
Type:PROTEIN
Mol. Mass.:88147.11
Organism:Rattus norvegicus
Description:ChEMBL_887445
Residue:773
BDBM50284163
NameBDBM50284163
Synonyms:(S)-4-Hexadecyl-2,6,6-trimethyl-2-oxo-2lambda*5*-[1,3,6,2]dioxazaphosphocan-6-ium; bromide | CHEMBL170076
TypeSmall organic molecule
Emp. Form.C23H49NO3P
Mol. Mass.418.6133
1C[N+](C)(C)CCO[P@](C)(=O)O1