Reaction Details
TargetPeroxisomal carnitine O-octanoyltransferase
LigandBDBM50284164
Substrate/Competitorn/a
Meas. Tech.ChEBML_46182
IC50 4000000±n/a nM
Citation Kumaravel, GBháird, NNFronczek, FRRamsay, RRAshendel, CLGandour, RD Evaluation of (2S,4S)/(2R,4R) and (2S,4R)/(2<... Bioorg Med Chem Lett4:883-886 (1994)    Article
 
Peroxisomal carnitine O-octanoyltransferase
Name:Peroxisomal carnitine O-octanoyltransferase
Type:PROTEIN
Mol. Mass.:70184.70
Organism:Homo sapiens (Human)
Description:ChEMBL_46182
Residue:612
BDBM50284164
NameBDBM50284164
Synonyms:(S)-2-Hexadecyl-2-hydroxy-4,4-dimethyl-morpholin-4-ium; bromide | CHEMBL169705
TypeSmall organic molecule
Emp. Form.C22H46NO2
Mol. Mass.356.6056
[C@@]1(O)C[N+](C)(C)CCO1