Reaction Details
TargetChymotrypsinogen B
LigandBDBM50133629
Substrate/Competitorn/a
Meas. Tech.ChEMBL_216622 (CHEMBL819194)
Ki 3800±n/a nM
Citation Iyer, RAHanna, PE N-(carbobenzyloxy)isatin: A slow binding α-keto lactam inhibitor of α-chymotrypsin Bioorg Med Chem Lett5:89-92 (1995)    Article
 
Chymotrypsinogen B
Name:Chymotrypsinogen B
Type:PROTEIN
Mol. Mass.:27713.98
Organism:Homo sapiens (Human)
Description:ChEMBL_10909
Residue:263
BDBM50133629
NameBDBM50133629
Synonyms:2,3-Dioxo-2,3-dihydro-indole-1-carboxylic acid benzyl ester | CHEMBL119515
TypeSmall organic molecule
Emp. Form.C16H11NO4
Mol. Mass.281.2628
SMILESO=C(OCc1ccccc1)N1C(=O)C(=O)c2ccccc12