Reaction Details
TargetPlatelet-activating factor receptor
LigandBDBM50284388
Substrate/Competitorn/a
Meas. Tech.ChEMBL_151707 (CHEMBL760600)
Ki 1.2±n/a nM
Citation Chung, SKBan, SHKim, SHKim, BEWoo, SHSummers, JBConway, RG Synthesis and bioactivities of heterocyclic lipids as PAF antagonists. 1 Bioorg Med Chem Lett5:1091-1096 (1995)    Article
 
Platelet-activating factor receptor
Name:Platelet-activating factor receptor
Type:Protein
Mol. Mass.:39005.63
Organism:Cavia porcellus
Description:n/a
Residue:342
BDBM50284388
NameBDBM50284388
Synonyms:2-{[Acetyl-(1-hexadecylcarbamoyloxymethyl-cyclopentylmethoxycarbonyl)-amino]-methyl}-1-ethyl-pyridinium; iodide | CHEMBL273639
TypeSmall organic molecule
Emp. Form.C35H60N3O5
Mol. Mass.602.8675
(=O)OCC1(COC(=O)N(Cc2cccc[n+]2CC)C(C)=O)CCCC1