Reaction Details
TargetKappa-type opioid receptor
LigandBDBM50008984
Substrate/Competitorn/a
Meas. Tech.ChEBML_92403
IC50 5893±n/a nM
Citation Kudzma, LVEvans, SMTurnbull, SPSevernak, SAEzell, EF Octahydro-1,2,3,4,4a,5,11,11a-pyrido[3,4-c][1,5]benzoxazepines: conformationally restricted fentanyl analogs Bioorg Med Chem Lett5:1177-1182 (1995)    Article
 
Kappa-type opioid receptor
Name:Kappa-type opioid receptor
Type:G Protein-Coupled Receptor (GPCR)
Mol. Mass.:42744.99
Organism:Cavia porcellus (domestic guinea pig)
Description:P41144
Residue:380
BDBM50008984
NameBDBM50008984
Synonyms:4-(4-Chloro-benzyl)-2-(1-methyl-azepan-4-yl)-2H-phthalazin-1-one Duragesic-100 Duragesic-25 Duragesic-75 FENTANYL CITRATE Fentanyl-100 Fentanyl-25 Fentanyl-75 Innovar N-(1-Phenethyl-piperidin-4-yl)-N-phenyl-propionamide N-(1-phenethylpiperidin-4-yl)-N-phenylpropionamide | US20230399418, Compound Fentanyl
TypeSmall organic molecule
Emp. Form.C22H28N2O
Mol. Mass.336.4705
SMILESCCC(=O)N(C1CCN(CCc2ccccc2)CC1)c1ccccc1