Reaction Details
TargetSubstance-P receptor
LigandBDBM50281976
Substrate/Competitorn/a
Meas. Tech.ChEMBL_216597 (CHEMBL821388)
IC50 2±n/a nM
Citation Swain, CJFong, TMHaworth, KOwen, SNSeward, EMStrader, CD Quinuclidine-based NK1 antagonists, the role of the benzhydryl Bioorg Med Chem Lett5:1261-1264 (1995)    Article
 
Substance-P receptor
Name:Substance-P receptor
Type:G Protein-Coupled Receptor (GPCR)
Mol. Mass.:46254.43
Organism:Homo sapiens (Human)
Description:P25103
Residue:407
BDBM50281976
NameBDBM50281976
Synonyms:(2S,3S)-2-Benzhydryl-3-(3,5-dimethyl-benzyloxy)-1-aza-bicyclo[2.2.2]octane CHEMBL283356 | L-706125
TypeSmall organic molecule
Emp. Form.C29H33NO
Mol. Mass.411.5784
SMILESCc1cc(C)cc(CO[C@H]2C3CCN(CC3)[C@H]2C(c2ccccc2)c2ccccc2)c1