Reaction Details
TargetCysteinyl leukotriene receptor 1
LigandBDBM50284681
Substrate/Competitorn/a
Meas. Tech.ChEBML_99992
Ki 6800±n/a nM
Citation Andrews, EGAntognoli, GWBreslow, RCarta, MPCarty, TJChambers, RJCheng, JBCohan, VLCollins, JLDamon, DBDelehunt, JEggler, JFEskra, JDFreiert, KWHada, WAMarfat, AMasamune, HMelvin, LSMularski, CJNaclerio, BA Synthesis and pharmacological profile of two novel heterocyclic chromanols, CP-80,798 and CP-85,958, as potent LTD4 receptor antagonists Bioorg Med Chem Lett5:1365-1370 (1995)    Article
 
Cysteinyl leukotriene receptor 1
Name:Cysteinyl leukotriene receptor 1
Type:Enzyme Catalytic Domain
Mol. Mass.:39007.58
Organism:GUINEA PIG
Description:Leukotriene D4 0 GUINEA PIG::Q2NNR5
Residue:340
BDBM50284681
NameBDBM50284681
Synonyms:2-Butyl-7-(quinolin-2-ylmethoxy)-1,2,3,4-tetrahydro-naphthalen-1-ol | CHEMBL28797
TypeSmall organic molecule
Emp. Form.C24H27NO2
Mol. Mass.361.4767
SMILESCCCCC1CCc2ccc(OCc3ccc4ccccc4n3)cc2C1O