Reaction Details
TargetCysteinyl leukotriene receptor 1
LigandBDBM50012434
Substrate/Competitorn/a
Meas. Tech.ChEBML_99992
Ki 8000±n/a nM
Citation Andrews, EGAntognoli, GWBreslow, RCarta, MPCarty, TJChambers, RJCheng, JBCohan, VLCollins, JLDamon, DBDelehunt, JEggler, JFEskra, JDFreiert, KWHada, WAMarfat, AMasamune, HMelvin, LSMularski, CJNaclerio, BA Synthesis and pharmacological profile of two novel heterocyclic chromanols, CP-80,798 and CP-85,958, as potent LTD4 receptor antagonists Bioorg Med Chem Lett5:1365-1370 (1995)    Article
 
Cysteinyl leukotriene receptor 1
Name:Cysteinyl leukotriene receptor 1
Type:Enzyme Catalytic Domain
Mol. Mass.:39007.58
Organism:GUINEA PIG
Description:Leukotriene D4 0 GUINEA PIG::Q2NNR5
Residue:340
BDBM50012434
NameBDBM50012434
Synonyms:(REV-5,901)1-[3-(Quinolin-2-ylmethoxy)-phenyl]-hexan-1-ol 1-[3-(Quinolin-2-ylmethoxy)-phenyl]-hexan-1-ol (RG 5901) CHEMBL8747 REV-901
TypeSmall organic molecule
Emp. Form.C22H25NO2
Mol. Mass.335.4394
SMILESCCCCCC(O)c1cccc(OCc2ccc3ccccc3n2)c1