Reaction Details
TargetInterstitial collagenase
LigandBDBM50284753
Substrate/Competitorn/a
Meas. Tech.ChEBML_101765
Ki 3±n/a nM
Citation Castelhano, ALBilledeau, RDewdney, NDonnelly, SHorne, SKurz, LJLiak, TJMartin, RUppington, RYuan, ZKrantz, A Novel indolactam-based inhibitors of matrix metalloproteinases Bioorg Med Chem Lett5:1415-1420 (1995)    Article
 
Interstitial collagenase
Name:Interstitial collagenase
Type:Enzyme
Mol. Mass.:54010.26
Organism:Homo sapiens (Human)
Description: P03956
Residue:469
BDBM50284753
NameBDBM50284753
Synonyms:(R)-N*1*-[(S)-1-Hexylcarbamoyl-2-(1H-indol-3-yl)-ethyl]-N*4*-hydroxy-2-isobutyl-succinamide | CHEMBL285418
TypeSmall organic molecule
Emp. Form.C25H38N4O4
Mol. Mass.458.5936
SMILESCCCCCCNC(=O)[C@H](Cc1c[nH]c2ccccc12)NC(=O)[C@H](CC(C)C)CC(=O)NO