Reaction Details
TargetMatrilysin
LigandBDBM50284752
Substrate/Competitorn/a
Meas. Tech.ChEBML_105051
Ki 1420±n/a nM
Citation Castelhano, ALBilledeau, RDewdney, NDonnelly, SHorne, SKurz, LJLiak, TJMartin, RUppington, RYuan, ZKrantz, A Novel indolactam-based inhibitors of matrix metalloproteinases Bioorg Med Chem Lett5:1415-1420 (1995)    Article
 
Matrilysin
Name:Matrilysin
Type:Enzyme
Mol. Mass.:29681.54
Organism:Homo sapiens (Human)
Description:P09237
Residue:267
BDBM50284752
NameBDBM50284752
Synonyms:CHEMBL31164 | {(S)-2-[(S)-1-Hexylcarbamoyl-2-(1H-indol-3-yl)-ethylcarbamoyl]-4-methyl-pentyl}-(quinolin-2-ylsulfanylmethyl)-phosphinic acid
TypeSmall organic molecule
Emp. Form.C34H45N4O4PS
Mol. Mass.636.784
SMILESCCCCCCNC(=O)[C@H](Cc1c[nH]c2ccccc12)NC(=O)[C@H](CC(C)C)CP(O)(=O)CSc1ccc2ccccc2n1