Reaction Details
Target72 kDa type IV collagenase
LigandBDBM50284757
Substrate/Competitorn/a
Meas. Tech.ChEBML_219181
Ki 472±n/a nM
Citation Castelhano, ALBilledeau, RDewdney, NDonnelly, SHorne, SKurz, LJLiak, TJMartin, RUppington, RYuan, ZKrantz, A Novel indolactam-based inhibitors of matrix metalloproteinases Bioorg Med Chem Lett5:1415-1420 (1995)    Article
 
72 kDa type IV collagenase
Name:72 kDa type IV collagenase
Type:Enzyme
Mol. Mass.:73870.36
Organism:Homo sapiens (Human)
Description: P08253
Residue:660
BDBM50284757
NameBDBM50284757
Synonyms:(R)-3-[(S)-1-Hexylcarbamoyl-2-(1H-indol-3-yl)-ethylcarbamoyl]-5-methyl-hexanoic acid | CHEMBL286904
TypeSmall organic molecule
Emp. Form.C25H37N3O4
Mol. Mass.443.579
SMILESCCCCCCNC(=O)[C@H](Cc1c[nH]c2ccccc12)NC(=O)[C@H](CC(C)C)CC(O)=O