Reaction Details
TargetInterstitial collagenase
LigandBDBM50284756
Substrate/Competitorn/a
Meas. Tech.ChEBML_101765
Ki 25±n/a nM
Citation Castelhano, ALBilledeau, RDewdney, NDonnelly, SHorne, SKurz, LJLiak, TJMartin, RUppington, RYuan, ZKrantz, A Novel indolactam-based inhibitors of matrix metalloproteinases Bioorg Med Chem Lett5:1415-1420 (1995)    Article
 
Interstitial collagenase
Name:Interstitial collagenase
Type:Enzyme
Mol. Mass.:54010.26
Organism:Homo sapiens (Human)
Description: P03956
Residue:469
BDBM50284756
NameBDBM50284756
Synonyms:(R)-5-Methyl-3-((S)-9-oxo-1,8-diaza-tricyclo[10.6.1.0*13,18*]nonadeca-12(19),13(18),14,16-tetraen-10-ylcarbamoyl)-hexanoic acid CHEMBL282146
TypeSmall organic molecule
Emp. Form.C25H35N3O4
Mol. Mass.441.5631
SMILESCC(C)C[C@H](CC(O)=O)C(=O)N[C@H]1Cc2cn(CCCCCCNC1=O)c1ccccc21