Reaction Details
TargetMatrilysin
LigandBDBM50284751
Substrate/Competitorn/a
Meas. Tech.ChEBML_105051
Ki 78±n/a nM
Citation Castelhano, ALBilledeau, RDewdney, NDonnelly, SHorne, SKurz, LJLiak, TJMartin, RUppington, RYuan, ZKrantz, A Novel indolactam-based inhibitors of matrix metalloproteinases Bioorg Med Chem Lett5:1415-1420 (1995)    Article
 
Matrilysin
Name:Matrilysin
Type:Enzyme
Mol. Mass.:29681.54
Organism:Homo sapiens (Human)
Description:P09237
Residue:267
BDBM50284751
NameBDBM50284751
Synonyms:CHEMBL30804 | [(S)-4-Methyl-2-((S)-9-oxo-1,8-diaza-tricyclo[10.6.1.0*13,18*]nonadeca-12(19),13(18),14,16-tetraen-10-ylcarbamoyl)-pentyl]-(quinolin-2-ylsulfanylmethyl)-phosphinic acid
TypeSmall organic molecule
Emp. Form.C34H43N4O4PS
Mol. Mass.634.768
SMILESCC(C)C[C@H](CP(O)(=O)CSc1ccc2ccccc2n1)C(=O)N[C@H]1Cc2cn(CCCCCCNC1=O)c1ccccc21