Reaction Details
TargetStromelysin-1
LigandBDBM50284755
Substrate/Competitorn/a
Meas. Tech.ChEBML_102094
Ki 15±n/a nM
Citation Castelhano, ALBilledeau, RDewdney, NDonnelly, SHorne, SKurz, LJLiak, TJMartin, RUppington, RYuan, ZKrantz, A Novel indolactam-based inhibitors of matrix metalloproteinases Bioorg Med Chem Lett5:1415-1420 (1995)    Article
 
Stromelysin-1
Name:Stromelysin-1
Type:Enzyme
Mol. Mass.:53973.13
Organism:Homo sapiens (Human)
Description: P08254
Residue:477
BDBM50284755
NameBDBM50284755
Synonyms:2-[(Formyl-hydroxy-amino)-methyl]-4-methyl-pentanoic acid ((11S,18R)-9-oxo-1,8-diaza-tricyclo[10.6.1.0*13,18*]nonadeca-12(19),13(18),14,16-tetraen-10-yl)-amide | CHEMBL30980
TypeSmall organic molecule
Emp. Form.C25H36N4O4
Mol. Mass.456.5777
SMILESCC(C)C[C@H](CN(O)C=O)C(=O)N[C@H]1Cc2cn(CCCCCCNC1=O)c1ccccc21