Reaction Details
TargetGlutamate receptor ionotropic, NMDA 1
LigandBDBM50284801
Substrate/Competitorn/a
Meas. Tech.ChEBML_140321
Ki 3.3±n/a nM
Citation Nagata, RKodo, TYamaguchi, HTanno, N Structure-activity relationships of tricyclic quinoxalinediones as potent antagonists for the glycine binding site of the NMDA receptor 2 Bioorg Med Chem Lett5:1533-1536 (1995)    Article
 
Glutamate receptor ionotropic, NMDA 1
Name:Glutamate receptor ionotropic, NMDA 1
Type:Enzyme Catalytic Domain
Mol. Mass.:105533.40
Organism:RAT
Description:P35439
Residue:938
BDBM50284801
NameBDBM50284801
Synonyms:((5R,6S)-9-Bromo-6-methyl-2,3-dioxo-2,3,6,7-tetrahydro-1H,5H-pyrido[1,2,3-de]quinoxalin-5-yl)-acetic acid | CHEMBL417514
TypeSmall organic molecule
Emp. Form.C14H13BrN2O4
Mol. Mass.353.168
SMILESC[C@H]1Cc2cc(Br)cc3[nH]c(=O)c(=O)n([C@@H]1CC(O)=O)c23